Bazel 
PublicReporting skipped test cases
Failed in 1h 17m
Slowest 20 targets
- //src/test/shell/bazel:bazel_determinism_test on
macOS arm64 (shard 4): FAILED in 3 out of 3 runs in 1921.4s (775.8s + 572.4s + 573.1s) (log)
- //src/test/py/bazel:runfiles_test on
Windows: FAILED in 3 out of 3 runs in 1555.7s (525.8s + 512.7s + 517.2s) (log)
- //src/test/shell/bazel:bazel_bootstrap_distfile_test on
Windows: PASSED in 1227.3s (log)
- //src/test/shell/bazel:bazel_proto_library_test (shard 2/2) on
Ubuntu 20.04 LTS: PASSED in 1027.5s (log)
- //src/test/shell/bazel:bazel_bootstrap_distfile_test on
macOS (shard 4): PASSED in 1018.6s (log)
- //src/test/shell/bazel:bazel_proto_library_test (shard 2/2) on
Ubuntu 22.04 LTS: PASSED in 980.3s (log)
- //src/test/shell/bazel:bazel_proto_library_test (shard 2/2) on
CentOS 7: PASSED in 957.1s (log)
- //src/test/shell/bazel:bazel_proto_library_test (shard 1/2) on
Ubuntu 20.04 LTS: PASSED in 944.6s (log)
- //src/test/shell/bazel:bazel_proto_library_test (shard 2/2) on
macOS arm64 (shard 5): PASSED in 911.0s (log)
- //src/test/shell/bazel:bazel_proto_library_test (shard 1/2) on
CentOS 7: PASSED in 904.6s (log)
- //src/test/py/bazel:test_wrapper_test on
Windows: TIMEOUT in 3 out of 3 runs in 900.4s (300.1s + 300.2s + 300.1s) (log)
- //src/test/shell/bazel:bazel_proto_library_test (shard 1/2) on
Ubuntu 22.04 LTS: PASSED in 871.7s (log)
- //src/test/shell/bazel:bazel_bootstrap_distfile_tar_test on
CentOS 7: PASSED in 838.2s (log)
- //src/test/shell/bazel:bazel_proto_library_test (shard 1/2) on
macOS arm64 (shard 5): PASSED in 815.9s (log)
- //src/test/shell/bazel:bazel_bootstrap_distfile_test on
CentOS 7: PASSED in 814.1s (log)
- //src/test/shell/bazel:bazel_bootstrap_distfile_tar_test on
Ubuntu 20.04 LTS: PASSED in 802.8s (log)
- //src/test/shell/bazel:bazel_determinism_test on
CentOS 7: PASSED in 802.3s (log)
- //src/test/shell/bazel:bazel_determinism_test on
Ubuntu 22.04 LTS: PASSED in 777.2s (log)
- //src/test/shell/bazel:bazel_java_test_jdk21_toolchain_head (shard 2/2) on
Ubuntu 22.04 LTS: PASSED in 767.8s (log)
- //src/test/shell/bazel:bazel_java_test_jdk21_toolchain_head (shard 1/2) on
Ubuntu 22.04 LTS: PASSED in 753.9s (log)
Windows Failures
- //src/test/py/bazel:runfiles_test FAILED in 3 out of 3 runs in 1555.7s (525.8s + 512.7s + 517.2s): log
- //src/test/py/bazel:test_wrapper_test TIMEOUT in 3 out of 3 runs in 900.4s (300.1s + 300.2s + 300.1s): log
- //src/test/py/bazel:bazel_windows_test FLAKY in 1 out of 2 runs in 516.1s (300.1s + 216.0s): log
CentOS 7 Failures
- //src/test/shell/bazel:bazel_strategy_test FLAKY in 1 out of 2 runs in 102.1s (60.6s + 41.6s): log
- //src/main/starlark/tests/builtins_bzl:cc_builtin_tests FLAKY in 1 out of 2 runs in 376.1s (238.3s + 137.8s): log
- //src/test/java/com/google/devtools/build/lib/metrics:MetricsCollectorTest FLAKY in 1 out of 2 runs in 42.4s (22.7s + 19.8s): log
4/5

Waited 8s
Ran in 52m 28s

Waited 8s
Ran in 1h 15m
Try Update Last Green Commitcurl -sS https://raw.githubusercontent.com/bazelbuild/continuous-integration/master/buildkite/bazelci.py?1729592985 -o bazelci.py && python3.6 bazelci.py try_update_last_green_commit
Waited 5s
Ran in 36s
Total Job Run Time: 11h 2m